carol-n
type: LexicalEntry
canonical form: carol
sense: 07049493-n
part of speech: noun

Christmas carol-n
type: LexicalEntry
canonical form: Christmas carol
sense: 07049493-n
part of speech: noun

07049493-n
type: LexicalConcept
in scheme: en-word.net
definition: joyful religious song celebrating the birth of Christ
ili: i73629
lexfile: noun.communication
part of speech: noun
hypernym: 07049166-n