Christianity-n
type: LexicalEntry
canonical form: Christianity
sense: 06236188-n
part of speech: noun
sense: 08099113-n

Christian religion-n
type: LexicalEntry
canonical form: Christian religion
sense: 06236188-n
part of speech: noun

06236188-n
type: LexicalConcept
in scheme: en-word.net
definition: a monotheistic system of beliefs and practices based on the Old Testament and the teachings of Jesus as embodied in the New Testament and emphasizing the role of Jesus as savior
ili: i69252
lexfile: noun.cognition
part of speech: noun
hypernym: 05955536-n

Christendom-n
type: LexicalEntry
canonical form: Christendom
sense: 08099113-n
part of speech: noun

08099113-n
type: LexicalConcept
in scheme: en-word.net
definition: the collective body of Christians throughout the world and history (found predominantly in Europe and the Americas and Australia)
example: for a thousand years the Roman Catholic Church was the principal church of Christendom
ili: i79690
lexfile: noun.group
part of speech: noun
hypernym: 07981699-n
mero part: 08099479-n
mero part: 08099776-n