Chennai-n
type: LexicalEntry
canonical form: Chennai
sense: 08924360-n
part of speech: noun

Madras-n
type: LexicalEntry
canonical form: Madras
sense: 08924360-n
part of speech: noun

08924360-n
type: LexicalConcept
in scheme: en-word.net
definition: a city in Tamil Nadu on the Bay of Bengal; formerly Madras
ili: i83533
lexfile: noun.location
part of speech: noun
instance hypernym: 08542298-n