Hall-n
type: LexicalEntry
canonical form: Hall
sense: 11044578-n
part of speech: noun

Charles Francis Hall-n
type: LexicalEntry
canonical form: Charles Francis Hall
sense: 11044578-n
part of speech: noun

11044578-n
type: LexicalConcept
in scheme: en-word.net
definition: United States explorer who led three expeditions to the Arctic (1821-1871)
ili: i95393
lexfile: noun.person
part of speech: noun
instance hypernym: 10092496-n