Carina-n
type: LexicalEntry
canonical form: Carina
sense: 09258984-n
part of speech: noun

09258984-n
type: LexicalConcept
in scheme: en-word.net
definition: a keel-shaped constellation in the Southern Hemisphere; contains the star Canopus
ili: i85165
lexfile: noun.object
part of speech: noun
instance hypernym: 09275876-n
mero member: 09256041-n