Jonah-n
type: LexicalEntry
canonical form: Jonah
sense: 06451594-n
part of speech: noun

Book of Jonah-n
type: LexicalEntry
canonical form: Book of Jonah
sense: 06451594-n
part of speech: noun

06451594-n
type: LexicalConcept
in scheme: en-word.net
definition: a book in the Old Testament that tells the story of Jonah and the whale
ili: i70327
lexfile: noun.communication
part of speech: noun
instance hypernym: 06406508-n