Bonn-n
type: LexicalEntry
canonical form: Bonn
sense: 08789970-n
part of speech: noun

08789970-n
type: LexicalConcept
in scheme: en-word.net
definition: a city in western Germany on the Rhine River; was the capital of West Germany between 1949 and 1989
ili: i82973
lexfile: noun.location
part of speech: noun
instance hypernym: 08542298-n