Boccaccio-n
type: LexicalEntry
canonical form: Boccaccio
sense: 10873742-n
part of speech: noun

Giovanni Boccaccio-n
type: LexicalEntry
canonical form: Giovanni Boccaccio
sense: 10873742-n
part of speech: noun

10873742-n
type: LexicalConcept
in scheme: en-word.net
definition: Italian poet (born in France) (1313-1375)
ili: i94491
lexfile: noun.person
part of speech: noun
instance hypernym: 10463768-n