Dylan-n
type: LexicalEntry
canonical form: Dylan
sense: 10967100-n
part of speech: noun

Bob Dylan-n
type: LexicalEntry
canonical form: Bob Dylan
sense: 10967100-n
part of speech: noun

10967100-n
type: LexicalConcept
in scheme: en-word.net
definition: United States songwriter noted for his protest songs (born in 1941)
ili: i94984
lexfile: noun.person
part of speech: noun
instance hypernym: 10643902-n
instance hypernym: 10619214-n