Bavaria-n
type: LexicalEntry
canonical form: Bavaria
sense: 08789429-n
part of speech: noun

08789429-n
type: LexicalConcept
in scheme: en-word.net
definition: a state in southern Germany famous for its beer; site of an automobile factory
ili: i82970
lexfile: noun.location
part of speech: noun
instance hypernym: 08671935-n
mero part: 08789861-n
mero part: 08792060-n