Australia-n
type: LexicalEntry
canonical form: Australia
sense: 08849996-n
part of speech: noun
sense: 09234173-n

Commonwealth of Australia-n
type: LexicalEntry
canonical form: Commonwealth of Australia
sense: 08849996-n
part of speech: noun

08849996-n
type: LexicalConcept
in scheme: en-word.net
definition:
  value: a nation occupying the whole of the Australian continent; Aboriginal tribes are thought to have migrated from southeastern Asia 20,000 years ago; first Europeans were British convicts sent there as a penal colony
ili: i83244
lexfile: noun.location
part of speech: noun
instance hypernym: 08562388-n
mero member: 09710675-n
mero part: 08851261-n
mero part: 08851439-n
mero part: 08851683-n
mero part: 08852122-n
mero part: 08852674-n
mero part: 08853115-n
mero part: 08853400-n
mero part: 08853646-n
mero part: 08853908-n
mero part: 08854180-n
mero part: 08854382-n
mero part: 09192454-n
mero part: 09192827-n
mero part: 09193006-n
mero part: 09195531-n
mero part: 09234642-n
mero part: 09258151-n
mero part: 09258376-n
mero part: 09300819-n
mero part: 09301068-n
mero part: 09314913-n
mero part: 09315254-n
mero part: 09315451-n
mero part: 09320826-n
mero part: 09386317-n
mero part: 09386517-n
mero part: 09387675-n

09234173-n
type: LexicalConcept
in scheme: en-word.net
definition: the smallest continent; between the South Pacific and the Indian Ocean
ili: i85030
lexfile: noun.object
part of speech: noun
instance hypernym: 09277520-n
mero part: 08849996-n
mero part: 08852973-n
mero part: 09191233-n
mero part: 09234642-n
mero part: 09258151-n
mero part: 09258376-n
mero part: 09286385-n
mero part: 09300819-n
mero part: 09301068-n
mero part: 09314913-n
mero part: 09315254-n
mero part: 09315451-n
mero part: 09382209-n
mero part: 09386317-n
mero part: 09386517-n