Assamese-a
type: LexicalEntry
canonical form: Assamese
sense: https://en-word.net/lemma/Assamese-a#02989010-a
part of speech: adjective

https://en-word.net/synset/02989010-a
type: LexicalConcept
in scheme: en-word.net
definition: of or relating to or characteristic of Assam or its people or culture or language
ili: i16989
lexfile: adj.pert
part of speech: adjective

Assamese-n
type: LexicalEntry
canonical form: Assamese
sense: 06983458-n
part of speech: noun
sense: 09693311-n

Asamiya-n
type: LexicalEntry
canonical form: Asamiya
sense: 06983458-n
part of speech: noun

Assamese language-n
type: LexicalEntry
canonical form: Assamese language
sense: 06983458-n
part of speech: noun

Asamiya language-n
type: LexicalEntry
canonical form: Asamiya language
sense: 06983458-n
part of speech: noun

06983458-n
type: LexicalConcept
in scheme: en-word.net
definition: the Magadhan language spoken by the Assamese people; closely related to Bengali
ili: i73246
lexfile: noun.communication
part of speech: noun
hypernym: 06983319-n

09693311-n
type: LexicalConcept
in scheme: en-word.net
definition: native or inhabitant of the state of Assam in northeastern India
ili: i87474
lexfile: noun.person
part of speech: noun
hypernym: 09693046-n