Asanga-n
type: LexicalEntry
canonical form: Asanga
sense: 10845011-n
part of speech: noun

10845011-n
type: LexicalConcept
in scheme: en-word.net
definition: Indian religious leader and founder of the Yogacara school of Buddhism in India (4th century)
ili: i94335
lexfile: noun.person
part of speech: noun
instance hypernym: 10539087-n