southernwood-n
type: LexicalEntry
canonical form: southernwood
sense: 11949760-n
part of speech: noun

Artemisia abrotanum-n
type: LexicalEntry
canonical form: Artemisia abrotanum
sense: 11949760-n
part of speech: noun

11949760-n
type: LexicalConcept
in scheme: en-word.net
definition: shrubby European wormwood naturalized in North America; sometimes used in brewing beer
ili: i99910
lexfile: noun.plant
part of speech: noun
hypernym: 11949018-n