Arnold-n
type: LexicalEntry
canonical form: Arnold
sense: 10843133-n
part of speech: noun
sense: 10843364-n

Benedict Arnold-n
type: LexicalEntry
canonical form: Benedict Arnold
sense: 10843133-n
part of speech: noun

10843133-n
type: LexicalConcept
in scheme: en-word.net
definition: United States general and traitor in the American Revolution; in 1780 his plan to surrender West Point to the British was foiled (1741-1801)
ili: i94326
lexfile: noun.person
part of speech: noun
exemplifies: 06730109-n
instance hypernym: 10143381-n
instance hypernym: 10742614-n

Matthew Arnold-n
type: LexicalEntry
canonical form: Matthew Arnold
sense: 10843364-n
part of speech: noun

10843364-n
type: LexicalConcept
in scheme: en-word.net
definition: English poet and literary critic (1822-1888)
ili: i94327
lexfile: noun.person
part of speech: noun
instance hypernym: 10463768-n
instance hypernym: 10285713-n