Armagnac-n
type: LexicalEntry
canonical form: Armagnac
sense: 07919971-n
part of speech: noun

07919971-n
type: LexicalConcept
in scheme: en-word.net
definition: dry brandy distilled in the Armagnac district of France
ili: i78793
lexfile: noun.food
part of speech: noun
hypernym: 07919448-n