Anubis-n
type: LexicalEntry
canonical form: Anubis
sense: 09534847-n
part of speech: noun

Anpu-n
type: LexicalEntry
canonical form: Anpu
sense: 09534847-n
part of speech: noun

09534847-n
type: LexicalConcept
in scheme: en-word.net
definition: Egyptian god of tombs and ruler of the underworld; usually depicted as a man with the head of a jackal
ili: i86606
lexfile: noun.person
part of speech: noun
instance hypernym: 09534037-n