Annapolis-n
type: LexicalEntry
canonical form: Annapolis
sense: 09116801-n
part of speech: noun

capital of Maryland-n
type: LexicalEntry
canonical form: capital of Maryland
sense: 09116801-n
part of speech: noun

09116801-n
type: LexicalConcept
in scheme: en-word.net
definition: state capital of Maryland; site of the United States Naval Academy
ili: i84419
lexfile: noun.location
part of speech: noun
instance hypernym: 08713353-n