Aegean-a
type: LexicalEntry
canonical form: Aegean
sense: https://en-word.net/lemma/Aegean-a#03028538-a
part of speech: adjective
sense: https://en-word.net/lemma/Aegean-a#03028672-a

https://en-word.net/synset/03028538-a
type: LexicalConcept
in scheme: en-word.net
definition: of or relating to or bordering the Aegean Sea
example: Aegean islands
ili: i17258
lexfile: adj.pert
part of speech: adjective

https://en-word.net/synset/03028672-a
type: LexicalConcept
in scheme: en-word.net
definition: of or relating to or characteristic of the prehistoric Aegean civilization
ili: i17259
lexfile: adj.pert
part of speech: adjective

Aegean-n
type: LexicalEntry
canonical form: Aegean
sense: 09211506-n
part of speech: noun

Aegean Sea-n
type: LexicalEntry
canonical form: Aegean Sea
sense: 09211506-n
part of speech: noun

09211506-n
type: LexicalConcept
in scheme: en-word.net
definition: an arm of the Mediterranean between Greece and Turkey; a main trade route for the ancient civilizations of Crete and Greece and Rome and Persia
ili: i84933
lexfile: noun.object
part of speech: noun
instance hypernym: 09449666-n
mero part: 08800479-n
mero part: 08808600-n