action-n
type: LexicalEntry
canonical form: action
sense: 92459306-n
part of speech: noun

92459306-n
type: LexicalConcept
in scheme: en-word.net
definition: In firearms terminology, the mechanism that handles the ammunition (loads, locks, fires, and extracts the cartridges).
example: Actions can be categorized in several ways, including single action versus double action, break action versus bolt action, and others.
  source: en.wikipedia.org
lexfile: noun.artifact
part of speech: noun
source: plWordNet 4.0
hypernym: 02680572-n