exigency-n
type: LexicalEntry
canonical form: exigency
sense: 92432634-n
part of speech: noun

92432634-n
type: LexicalConcept
in scheme: en-word.net
definition: that which is required in a particular situation — usually used in plural.
example: The trench maps used in the Great War resulted from the exigencies of war.
lexfile: noun.state
part of speech: noun
source: plWordNet 4.0
hypernym: 14474157-n