rabidity-n
type: LexicalEntry
canonical form: rabidity
sense: 92423443-n
part of speech: noun

92423443-n
type: LexicalConcept
in scheme: en-word.net
definition: The property of being very extreme, unreasonable, or fanatical in opinion; excessively zealous; comparable to one with rabies.
example: Ten years since Joss Whedon's western-in-space cult classic Firefly went off the air, the rabidity of its fandom, better known as the Browncoats, hasn't waned at all.
lexfile: noun.attribute
part of speech: noun
source: plWordNet 4.0
hypernym: 04870305-n