queen-n
type: LexicalEntry
canonical form: queen
sense: 85801071-n
part of speech: noun

85801071-n
type: LexicalConcept
in scheme: en-word.net
definition: a female competitor who holds a preeminent position
lexfile: noun.person
part of speech: noun
hypernym: 10807146-n
hypernym: 10254721-n