sight-n
type: LexicalEntry
canonical form: sight
sense: 82981785-n
part of speech: noun

82981785-n
type: LexicalConcept
in scheme: en-word.net
definition: a place of interest, especially to visitors
example: we spent a week in Rome looking at all the sights
  source: sight
lexfile: noun.cognition
part of speech: noun
hypernym: 05862385-n