watch-n
type: LexicalEntry
canonical form: watch
sense: 15317745-n
part of speech: noun

15317745-n
type: LexicalConcept
in scheme: en-word.net
definition: the period during which someone (especially a guard) is on duty
ili: i117613
lexfile: noun.time
part of speech: noun
hypernym: 15137796-n