watch-n
type: LexicalEntry
canonical form: watch
sense: 15317579-n
part of speech: noun

15317579-n
type: LexicalConcept
in scheme: en-word.net
definition: a period of time (4 or 2 hours) during which some of a ship's crew are on duty
ili: i117612
lexfile: noun.time
part of speech: noun
hypernym: 15317037-n