rate-n
type: LexicalEntry
canonical form: rate
sense: 15311467-n
part of speech: noun

15311467-n
type: LexicalConcept
in scheme: en-word.net
definition: a magnitude or frequency relative to a time unit
example: they traveled at a rate of 55 miles per hour
example: the rate of change was faster than expected
ili: i117586
lexfile: noun.time
part of speech: noun
hypernym: 13837364-n