pace-n
type: LexicalEntry
canonical form: pace
sense: 15305715-n
part of speech: noun

gait-n
type: LexicalEntry
canonical form: gait
sense: 15305715-n
part of speech: noun

15305715-n
type: LexicalConcept
in scheme: en-word.net
definition: the rate of moving (especially walking or running)
ili: i117551
lexfile: noun.time
part of speech: noun
hypernym: 15311467-n