game-n
type: LexicalEntry
canonical form: game
sense: 15281378-n
part of speech: noun

15281378-n
type: LexicalConcept
in scheme: en-word.net
definition: (tennis) a division of play during which one player serves
ili: i117419
lexfile: noun.time
part of speech: noun
domain topic: 00483309-n
hypernym: 05876035-n