year-n
type: LexicalEntry
canonical form: year
sense: 15229093-n
part of speech: noun

15229093-n
type: LexicalConcept
in scheme: en-word.net
definition: a period of time occupying a regular part of a calendar year that is used for some particular activity
example: a school year
ili: i117118
lexfile: noun.time
part of speech: noun
hypernym: 15137796-n