checkout-n
type: LexicalEntry
canonical form: checkout
sense: 15206117-n
part of speech: noun

checkout time-n
type: LexicalEntry
canonical form: checkout time
sense: 15206117-n
part of speech: noun

15206117-n
type: LexicalConcept
in scheme: en-word.net
definition: the latest time for vacating a hotel room
example: the checkout here is 12 noon
ili: i116989
lexfile: noun.time
part of speech: noun
hypernym: 15205929-n