festival-n
type: LexicalEntry
canonical form: festival
sense: 15187435-n
part of speech: noun

15187435-n
type: LexicalConcept
in scheme: en-word.net
definition: a day or period of time set aside for feasting and celebration
ili: i116891
lexfile: noun.time
part of speech: noun
hypernym: 15137796-n