turnaround-n
type: LexicalEntry
canonical form: turnaround
sense: 15162247-n
part of speech: noun

turnaround time-n
type: LexicalEntry
canonical form: turnaround time
sense: 15162247-n
part of speech: noun

15162247-n
type: LexicalConcept
in scheme: en-word.net
definition: time need to prepare a vessel or ship for a return trip
ili: i116745
lexfile: noun.time
part of speech: noun
hypernym: 15143170-n