duration-n
type: LexicalEntry
canonical form: duration
sense: 15158440-n
part of speech: noun

continuance-n
type: LexicalEntry
canonical form: continuance
sense: 15158440-n
part of speech: noun

15158440-n
type: LexicalConcept
in scheme: en-word.net
definition: the property of enduring or continuing in time
ili: i116722
lexfile: noun.time
part of speech: noun
hypernym: 00028468-n