clock time-n
type: LexicalEntry
canonical form: clock time
sense: 15154879-n
part of speech: noun

time-n
type: LexicalEntry
canonical form: time
sense: 15154879-n
part of speech: noun

15154879-n
type: LexicalConcept
in scheme: en-word.net
definition: a reading of a point in time as given by a clock
example: do you know what time it is?
example: the time is 10 o'clock
ili: i116704
lexfile: noun.time
part of speech: noun
attribute: https://en-word.net/synset/00131484-a
attribute: https://en-word.net/synset/00131668-a
hypernym: 05824916-n