vehicle-n
type: LexicalEntry
canonical form: vehicle
sense: 15136653-n
part of speech: noun

15136653-n
type: LexicalConcept
in scheme: en-word.net
definition: any substance that facilitates the use of a drug or pigment or other material that is mixed with it
ili: i116624
lexfile: noun.substance
part of speech: noun
hypernym: 00020270-n