essence-n
type: LexicalEntry
canonical form: essence
sense: 15134663-n
part of speech: noun

15134663-n
type: LexicalConcept
in scheme: en-word.net
definition: any substance possessing to a high degree the predominant properties of a plant or drug or other natural product from which it is extracted
ili: i116614
lexfile: noun.substance
part of speech: noun
hypernym: 00019793-n