turquoise-n
type: LexicalEntry
canonical form: turquoise
sense: 15106765-n
part of speech: noun

15106765-n
type: LexicalConcept
in scheme: en-word.net
definition: a blue to grey green mineral consisting of copper aluminum phosphate
example: blue turquoise is valued as a gemstone
ili: i116452
lexfile: noun.substance
part of speech: noun
hypernym: 14686753-n
hypernym: 14994225-n