solid-n
type: LexicalEntry
canonical form: solid
sense: 15071467-n
part of speech: noun

15071467-n
type: LexicalConcept
in scheme: en-word.net
definition: matter that is solid at room temperature and pressure
ili: i116244
lexfile: noun.substance
part of speech: noun
hypernym: 00021007-n