smelling salts-n
type: LexicalEntry
canonical form: smelling salts
sense: 15067966-n
part of speech: noun

15067966-n
type: LexicalConcept
in scheme: en-word.net
definition: a pungent preparation of ammonium carbonate and perfume; sniffed as a stimulant to relieve faintness
ili: i116223
lexfile: noun.substance
part of speech: noun
hypernym: 14897792-n
mero substance: 15076630-n