sand-n
type: LexicalEntry
canonical form: sand
sense: 15043597-n
part of speech: noun

15043597-n
type: LexicalConcept
in scheme: en-word.net
definition: a loose material consisting of grains of rock or coral
ili: i116081
lexfile: noun.substance
part of speech: noun
hypernym: 14868863-n
mero substance: 14678720-n