gunpowder-n
type: LexicalEntry
canonical form: gunpowder
sense: 15040881-n
part of speech: noun

powder-n
type: LexicalEntry
canonical form: powder
sense: 15040881-n
part of speech: noun

15040881-n
type: LexicalConcept
in scheme: en-word.net
definition: a mixture of potassium nitrate, charcoal, and sulfur in a 75:15:10 ratio which is used in gunnery, time fuses, and fireworks
ili: i116064
lexfile: noun.substance
part of speech: noun
hypernym: 03309675-n