rubber-n
type: LexicalEntry
canonical form: rubber
sense: 15031356-n
part of speech: noun

synthetic rubber-n
type: LexicalEntry
canonical form: synthetic rubber
sense: 15031356-n
part of speech: noun

15031356-n
type: LexicalConcept
in scheme: en-word.net
definition: any of various synthetic elastic materials whose properties resemble natural rubber
ili: i116014
lexfile: noun.substance
part of speech: noun
domain topic: 00845915-n
hypernym: 14926110-n