product-n
type: LexicalEntry
canonical form: product
sense: 15022266-n
part of speech: noun

15022266-n
type: LexicalConcept
in scheme: en-word.net
definition: a chemical substance formed as a result of a chemical reaction
example: a product of lime and nitric acid
ili: i115959
lexfile: noun.substance
part of speech: noun
hypernym: 14831008-n