lake-n
type: LexicalEntry
canonical form: lake
sense: 15015571-n
part of speech: noun

15015571-n
type: LexicalConcept
in scheme: en-word.net
definition: any of numerous bright translucent organic pigments
ili: i115922
lexfile: noun.substance
part of speech: noun
hypernym: 15014387-n