mortar-n
type: LexicalEntry
canonical form: mortar
sense: 14980028-n
part of speech: noun

14980028-n
type: LexicalConcept
in scheme: en-word.net
definition: used as a bond in masonry or for covering a wall
ili: i115729
lexfile: noun.substance
part of speech: noun
hypernym: 14810638-n
mero substance: 14828345-n