jet-n
type: LexicalEntry
canonical form: jet
sense: 14949516-n
part of speech: noun

14949516-n
type: LexicalConcept
in scheme: en-word.net
definition: a hard black form of lignite that takes a brilliant polish and is used in jewelry or ornamentation
ili: i115541
lexfile: noun.substance
part of speech: noun
hypernym: 14839433-n