impregnation-n
type: LexicalEntry
canonical form: impregnation
sense: 14940947-n
part of speech: noun

14940947-n
type: LexicalConcept
in scheme: en-word.net
definition: material with which something is impregnated
example: the impregnation, whatever it was, had turned the rock blue
ili: i115485
lexfile: noun.substance
part of speech: noun
hypernym: 14604877-n