glass-n
type: LexicalEntry
canonical form: glass
sense: 14905454-n
part of speech: noun

14905454-n
type: LexicalConcept
in scheme: en-word.net
definition: a brittle transparent solid with irregular atomic structure
ili: i115274
lexfile: noun.substance
part of speech: noun
hypernym: 15071467-n