catalyst-n
type: LexicalEntry
canonical form: catalyst
sense: 14747789-n
part of speech: noun

accelerator-n
type: LexicalEntry
canonical form: accelerator
sense: 14747789-n
part of speech: noun

14747789-n
type: LexicalConcept
in scheme: en-word.net
definition: (chemistry) a substance that initiates or accelerates a chemical reaction without itself being affected
ili: i114375
lexfile: noun.substance
part of speech: noun
domain topic: 06094057-n
hypernym: 14747240-n